Target
Delta-type opioid receptor
Ligand
BDBM50088710
Substrate
Meas. Tech.
ChEBML_147034
Ki
9±n/a nM
Citation
 Boyd, RECarson, JRCodd, EEGauthier, ADNeilson, LAZhang, SP Synthesis and binding affinities of 4-diarylaminotropanes, a new class of delta opioid agonists. Bioorg Med Chem Lett 10:1109-11 (2000)  
Target
Name:
Delta-type opioid receptor
Synonyms:
Cytochrome P450 3A4 Delta opioid receptor Delta-type opioid receptor (DOR) OPRD_RAT Opioid receptor Opioid receptors; mu & delta Ror-a | Voltage-gated potassium channel
Type:
G Protein-Coupled Receptor (GPCR)
Mol. Mass.:
40465.04
Organism:
Rattus norvegicus (rat)
Description:
Competition binding assays were using CHO-K1 cell membranes expressing the opioid receptor.
Residue:
372
  
Inhibitor
Name:
BDBM50088710
Synonyms:
CHEMBL268981 | N,N-Diethyl-4-[((1R,3S,5S)-8-methyl-8-aza-bicyclo[3.2.1]oct-3-yl)-(3-methylsulfanyl-phenyl)-amino]-benzamide
Type:
Small organic molecule
Emp. Form.:
C26H35N3OS
Mol. Mass.:
437.641
SMILES:
CCN(CC)C(=O)c1ccc(cc1)N([C@H]1C[C@@H]2CC[C@H](C1)N2C)c1cccc(SC)c1
: