Target
Tissue-type plasminogen activator
Ligand
BDBM50088987
Substrate
Meas. Tech.
ChEBML_207872
IC50
>2500±n/a nM
Citation
 Tamura, SYWeinhouse, MIRoberts, CAGoldman, EAMasukawa, KAnderson, SMCohen, CRBradbury, AEBernardino, VTDixon, SAMa, MGNolan, TGBrunck, TK Synthesis and biological activity of peptidyl aldehyde urokinase inhibitors. Bioorg Med Chem Lett 10:983-7 (2000)  
Target
Name:
Tissue-type plasminogen activator
Synonyms:
Alteplase Reteplase Thrombin receptor protein Tissue-type plasminogen activator (tPA) t-PA t-plasminogen activator
Type:
Enzyme
Mol. Mass.:
62931.08
Organism:
Homo sapiens (Human)
Description:
Residue:
562
  
Inhibitor
Name:
BDBM50088987
Synonyms:
CHEMBL174813 | {1-[1-(1-Carbamimidoyl-2-hydroxy-piperidin-3-ylcarbamoyl)-ethylcarbamoyl]-2-hydroxy-ethyl}-carbamic acid isobutyl ester; TFA
Type:
Small organic molecule
Emp. Form.:
C17H32N6O6
Mol. Mass.:
416.4726
SMILES:
CC(C)COC(=O)N[C@H](CO)C(=O)N[C@@H](C)C(=O)N[C@H]1CCCN(C1O)C(N)=N
: