Target
Urokinase-type plasminogen activator
Ligand
BDBM50088985
Substrate
Meas. Tech.
ChEBML_212977
IC50
12±n/a nM
Citation
 Tamura, SYWeinhouse, MIRoberts, CAGoldman, EAMasukawa, KAnderson, SMCohen, CRBradbury, AEBernardino, VTDixon, SAMa, MGNolan, TGBrunck, TK Synthesis and biological activity of peptidyl aldehyde urokinase inhibitors. Bioorg Med Chem Lett 10:983-7 (2000)  
Target
Name:
Urokinase-type plasminogen activator
Synonyms:
PLAU UROK_HUMAN Urokinase-type plasminogen activator (uPA) | Urokinase-type plasminogen activator/surface receptor
Type:
Enzyme
Mol. Mass.:
48528.62
Organism:
Homo sapiens (Human)
Description:
P00749
Residue:
431
  
Inhibitor
Name:
BDBM50088985
Synonyms:
CHEMBL369042 | {2-[2-(1-Carbamimidoyl-2-hydroxy-piperidin-3-ylcarbamoyl)-pyrrolidin-1-yl]-1-hydroxymethyl-2-oxo-ethyl}-carbamic acid benzyl ester
Type:
Small organic molecule
Emp. Form.:
C22H32N6O6
Mol. Mass.:
476.5261
SMILES:
NC(=N)N1CCCC(NC(=O)[C@H]2CCCN2C(=O)C(CO)NC(=O)OCc2ccccc2)C1O
: