Target
Integrin alpha-4
Ligand
BDBM50089023
Substrate
Meas. Tech.
ChEMBL_214667 (CHEMBL820785)
IC50
0.500000±n/a nM
Citation
 Fotouhi, NJoshi, PTilley, JWRowan, KSchwinge, VWolitzky, B Cyclic thioether peptide mimetics as VCAM-VLA-4 antagonists. Bioorg Med Chem Lett 10:1167-9 (2000)  
Target
Name:
Integrin alpha-4
Synonyms:
CD49 antigen-like family member D CD49d antigen ITA4_HUMAN Integrin alpha-4 Integrin alpha-IV VLA-4 integrin alpha 4 precursor | integrin alpha-4 precursor
Type:
Membrane Protein
Mol. Mass.:
114897.35
Organism:
Homo sapiens (Human)
Description:
P13612
Residue:
1032
  
Inhibitor
Name:
BDBM50089023
Synonyms:
(8S,13R)-13-{[1-Acetyl-3-(4-hydroxy-phenyl)-pyrrolidine-2-carbonyl]-amino}-6,14-dioxo-11-thia-7,15-diaza-spiro[4.12]heptadecane-8-carboxylic acid | CHEMBL275817
Type:
Small organic molecule
Emp. Form.:
C28H38N4O7S
Mol. Mass.:
574.689
SMILES:
CC(=O)N1CCC(C1C(=O)N[C@H]1CSCC[C@H](NC(=O)C2(CCCC2)CCNC1=O)C(O)=O)c1ccc(O)cc1
: