Target
Gastrin-releasing peptide receptor
Ligand
BDBM50408923
Substrate
Meas. Tech.
ChEMBL_39236 (CHEMBL655732)
Ki
>0.000±n/a nM
Comments
>0.000010 20220122
Citation
 Cristau, MDevin, COiry, CChaloin, OAmblard, MBernad, NHeitz, AFehrentz, JAMartinez, J Synthesis and biological evaluation of bombesin constrained analogues. J Med Chem 43:2356-61 (2000)  
Target
Name:
Gastrin-releasing peptide receptor
Synonyms:
GRPR_RAT Gastrin-releasing peptide receptor | Grpr
Type:
Enzyme Catalytic Domain
Mol. Mass.:
43227.55
Organism:
RAT
Description:
Gastrin-Releasing peptide 0 RAT::P52500
Residue:
384
  
Inhibitor
Name:
BDBM50408923
Synonyms:
CHEMBL2114155
Type:
Small organic molecule
Emp. Form.:
C52H72N14O10
Mol. Mass.:
1053.2159
SMILES:
CC(C)C[C@H](NC(=O)[C@H](CC(C)C)NC(=O)[C@H](Cc1cnc[nH]1)NC(=O)CN1CC[C@@H](NC(=O)[C@H](C)NC(=O)[C@H](Cc2c[nH]c3ccccc23)NC(=O)[C@H](CCC(N)=O)NC(=O)[C@H](N)Cc2ccccc2)C1=O)C(N)=O
: