Target
Adenosine kinase
Ligand
BDBM50533832
Substrate
Meas. Tech.
ChEMBL_1927381 (CHEMBL4430453)
Ki
5640±n/a nM
Citation
 Köse, MSchiedel, ACBauer, AAPoschenrieder, HBurbiel, JCAkkinepally, RRStachel, HDMüller, CE Focused screening to identify new adenosine kinase inhibitors. Bioorg Med Chem 24:5127-5133 (2016)  
Target
Name:
Adenosine kinase
Synonyms:
ADK | ADK_HUMAN
Type:
PROTEIN
Mol. Mass.:
40545.97
Organism:
Homo sapiens (Human)
Description:
ChEMBL_1467841
Residue:
362
  
Inhibitor
Name:
BDBM50533832
Synonyms:
CHEMBL4524434
Type:
Small organic molecule
Emp. Form.:
C17H9ClN4S2
Mol. Mass.:
368.863
SMILES:
Sc1nnc2c3c(nc(-c4ccccc4Cl)n12)sc1ccccc31
: