Target
Chitin synthase 1
Ligand
BDBM50089536
Substrate
Meas. Tech.
ChEBML_49240
IC50
0.140000±n/a nM
Citation
 Masubuchi, KTaniguchi, MUmeda, IHattori, KSuda, HKohchi, YIsshiki, YSakai, TKohchi, MShirai, MOkabe, HSudoh, MYamazaki, TShimma, N Synthesis and structure-activity relationships of novel fungal chitin synthase inhibitors. Bioorg Med Chem Lett 10:1459-62 (2000)  
Target
Name:
Chitin synthase 1
Synonyms:
CHS1 Chitin synthase | Chitin synthase 1
Type:
PROTEIN
Mol. Mass.:
88249.31
Organism:
Candida albicans
Description:
ChEMBL_49240
Residue:
776
  
Inhibitor
Name:
BDBM50089536
Synonyms:
5-[(6,6-Dimethyl-hepta-2,4-diynyl)-methyl-amino]-3,4-dihydro-1H-quinolin-2-one | CHEMBL36409
Type:
Small organic molecule
Emp. Form.:
C19H22N2O
Mol. Mass.:
294.3908
SMILES:
CN(CC#CC#CC(C)(C)C)c1cccc2NC(=O)CCc12
: