Target
Trifunctional purine biosynthetic protein adenosine-3
Ligand
BDBM50089594
Substrate
Meas. Tech.
ChEBML_70823
Ki
45000±n/a nM
Citation
 Boger, DLMarsilje, THCastro, RAHedrick, MPJin, QBaker, SJShim, JHBenkovic, SJ Design, synthesis, and biological evaluation of fluoronitrophenyl substituted folate analogues as potential inhibitors of GAR transformylase and AICAR transformylase. Bioorg Med Chem Lett 10:1471-5 (2000)  
Target
Name:
Trifunctional purine biosynthetic protein adenosine-3
Synonyms:
GAR Tfase GART Glycinamide ribonucleotide transformylase (GAR Tfase) PRGS Thymidylate synthase/GAR transformylase/AICAR transformylase
Type:
Protein
Mol. Mass.:
107768.47
Organism:
Homo sapiens (Human)
Description:
P22102
Residue:
1010
  
Inhibitor
Name:
BDBM50089594
Synonyms:
2-{4-[(2-Amino-4-oxo-3,4-dihydro-quinazolin-6-ylmethyl)-(3-fluoro-4-nitro-benzyl)-amino]-benzoylamino}-pentanedioic acid | CHEMBL287700
Type:
Small organic molecule
Emp. Form.:
C28H25FN6O8
Mol. Mass.:
592.5319
SMILES:
Nc1nc2ccc(CN(Cc3ccc(c(F)c3)[N+]([O-])=O)c3ccc(cc3)C(=O)NC(CCC(O)=O)C(O)=O)cc2c(=O)[nH]1
: