Target
Endothelin-1 receptor
Ligand
BDBM50089727
Substrate
Meas. Tech.
ChEBML_63354
IC50
5600±n/a nM
Citation
 Zhang, JDidierlaurent, SFortin, MLefrançois, DUridat, EVevert, JP Nonpeptide endothelin antagonists: from lower affinity pyrazol-5-ols to higher affinity pyrazole-5-carboxylic acids. Bioorg Med Chem Lett 10:1351-5 (2000)  
Target
Name:
Endothelin-1 receptor
Synonyms:
EDNRA_RAT Ednra Endothelin-1 receptor
Type:
Enzyme Catalytic Domain
Mol. Mass.:
48256.91
Organism:
RAT
Description:
ENDOTHELIN A EDNRA RAT::P26684
Residue:
426
  
Inhibitor
Name:
BDBM50089727
Synonyms:
2,4-Bis-benzo[1,3]dioxol-5-ylmethyl-5-trifluoromethyl-2H-pyrazol-3-ol | CHEMBL3144602
Type:
Small organic molecule
Emp. Form.:
C20H15F3N2O5
Mol. Mass.:
420.3387
SMILES:
FC(F)(F)c1[nH]n(Cc2ccc3OCOc3c2)c(=O)c1Cc1ccc2OCOc2c1
: