Target
Neuropeptide Y receptor type 1
Ligand
BDBM50090271
Substrate
Meas. Tech.
ChEBML_78193
IC50
3000±n/a nM
Citation
 Aiglstorfer, IHendrich, IMoser, CBernhardt, GDove, SBuschauer, A Structure-activity relationships of neuropeptide Y Y1 receptor antagonists related to BIBP 3226. Bioorg Med Chem Lett 10:1597-600 (2000)  
Target
Name:
Neuropeptide Y receptor type 1
Synonyms:
NPY-Y1 NPY1R NPYR neuropeptide Y receptor Y1
Type:
Enzyme Catalytic Domain
Mol. Mass.:
44399.07
Organism:
Homo sapiens (Human)
Description:
NPY-Y1 NPY1R HUMAN::P25929
Residue:
384
  
Inhibitor
Name:
BDBM50090271
Synonyms:
2-[2-(4-Chloro-phenyl)-2-phenyl-acetylamino]-5-guanidino-pentanoic acid (S)-indan-1-ylamide | CHEMBL41686
Type:
Small organic molecule
Emp. Form.:
C29H32ClN5O2
Mol. Mass.:
518.05
SMILES:
NC(=N)NCCCC(NC(=O)C(c1ccccc1)c1ccc(Cl)cc1)C(=O)N[C@H]1CCc2ccccc12
: