Target
72 kDa type IV collagenase
Ligand
BDBM50090346
Substrate
Meas. Tech.
ChEBML_104391
IC50
>10000±n/a nM
Citation
 Salvino, JMMathew, RKiesow, TNarensingh, RMason, HJDodd, AGroneberg, RBurns, CJMcGeehan, GKline, JOrton, ETang, SYMorrisette, MLabaudininiere, R Solid-phase synthesis of an arylsulfone hydroxamate library. Bioorg Med Chem Lett 10:1637-40 (2000)  
Target
Name:
72 kDa type IV collagenase
Synonyms:
72 kDa gelatinase CLG4A Gelatinase A (MMP-2) MMP2_HUMAN Matrix metalloproteinase-2 (MMP 2) Matrix metalloproteinases 2 (MMP-2) | TBE-1
Type:
Enzyme
Mol. Mass.:
73870.36
Organism:
Homo sapiens (Human)
Description:
P08253
Residue:
660
  
Inhibitor
Name:
BDBM50090346
Synonyms:
3-(3-Cyclopentyloxy-4-methoxy-benzenesulfonyl)-N-hydroxy-3-[3-(4-methoxy-phenoxy)-phenyl]-propionamide | CHEMBL42104
Type:
Small organic molecule
Emp. Form.:
C28H31NO8S
Mol. Mass.:
541.613
SMILES:
COc1ccc(Oc2cccc(c2)C(CC(=O)NO)S(=O)(=O)c2ccc(OC)c(OC3CCCC3)c2)cc1
: