Target
Neuropeptide Y receptor type 5
Ligand
BDBM50090396
Substrate
Meas. Tech.
ChEBML_143994
IC50
31±n/a nM
Citation
 McNally, JJYoungman, MALovenberg, TWNepomuceno, DWilson, SDax, SL N-acylated alpha-(3-pyridylmethyl)-beta-aminotetralin antagoinists of the human neuropeptide Y Y5 receptor. Bioorg Med Chem Lett 10:1641-3 (2000)  
Target
Name:
Neuropeptide Y receptor type 5
Synonyms:
NPY-Y5 NPY5-R NPY5R_HUMAN NPYY5 Neuropeptide Y receptor type 5 ( NPY Y5) | Y5 receptor
Type:
Enzyme
Mol. Mass.:
50746.64
Organism:
Homo sapiens (Human)
Description:
Q15761
Residue:
445
  
Inhibitor
Name:
BDBM50090396
Synonyms:
CHEMBL44036 | [4-(6-Fluoro-1-pyridin-3-ylmethyl-1,2,3,4-tetrahydro-naphthalen-2-ylcarbamoyl)-cyclohexylmethyl]-carbamic acid phenyl ester
Type:
Small organic molecule
Emp. Form.:
C31H34FN3O3
Mol. Mass.:
515.6184
SMILES:
Fc1ccc2C(Cc3cccnc3)C(CCc2c1)NC(=O)[C@H]1CC[C@H](CNC(=O)Oc2ccccc2)CC1
: