Target
Botulinum neurotoxin type A
Ligand
BDBM50076267
Substrate
Meas. Tech.
ChEMBL_1929499 (CHEMBL4432675)
Ki
700±n/a nM
Citation
 Zhou, YMcGillick, BETeng, YGHaranahalli, KOjima, ISwaminathan, SRizzo, RC Identification of small molecule inhibitors of botulinum neurotoxin serotype E via footprint similarity. Bioorg Med Chem 24:4875-4889 (2016)  
Target
Name:
Botulinum neurotoxin type A
Synonyms:
BXA1_CLOBO bonT | botA
Type:
PROTEIN
Mol. Mass.:
149450.01
Organism:
Clostridium botulinum
Description:
ChEMBL_1510137
Residue:
1296
  
Inhibitor
Name:
BDBM50076267
Synonyms:
(2S,3S)-2,3-Bis-[(E)-3-(3,4-dihydroxy-phenyl)-acryloyloxy]-succinic acid D-chicoric acid | chicoric acid
Type:
Small organic molecule
Emp. Form.:
C22H18O12
Mol. Mass.:
474.3711
SMILES:
OC(=O)[C@@H](OC(=O)\C=C\c1ccc(O)c(O)c1)[C@H](OC(=O)\C=C\c1ccc(O)c(O)c1)C(O)=O
: