Target
Cytochrome P450 2C9
Ligand
BDBM50090660
Substrate
Meas. Tech.
ChEMBL_51551 (CHEMBL840930)
Ki
3000±n/a nM
Citation
 Rao, SAoyama, RSchrag, MTrager, WFRettie, AJones, JP A refined 3-dimensional QSAR of cytochrome P450 2C9: computational predictions of drug interactions. J Med Chem 43:2789-96 (2000)  
Target
Name:
Cytochrome P450 2C9
Synonyms:
(R)-limonene 6-monooxygenase CP2C9_HUMAN CYP2C9 Cytochrome P450 2C9 (CYP2C9 ) P-450MP P450 PB-1 | S-mephenytoin 4-hydroxylase
Type:
Enzyme
Mol. Mass.:
55636.33
Organism:
Homo sapiens (Human)
Description:
P11712
Residue:
490
  
Inhibitor
Name:
BDBM50090660
Synonyms:
4-Ethynyl-N-(5-methyl-isoxazol-3-yl)-benzenesulfonamide | CHEMBL94536
Type:
Small organic molecule
Emp. Form.:
C12H10N2O3S
Mol. Mass.:
262.284
SMILES:
Cc1cc(NS(=O)(=O)c2ccc(cc2)C#C)no1
: