Target
Prostaglandin G/H synthase 1
Ligand
BDBM22952
Substrate
Meas. Tech.
ChEMBL_159279 (CHEMBL764263)
IC50
33000±n/a nM
Citation
 Kalgutkar, ASMarnett, ABCrews, BCRemmel, RPMarnett, LJ Ester and amide derivatives of the nonsteroidal antiinflammatory drug, indomethacin, as selective cyclooxygenase-2 inhibitors. J Med Chem 43:2860-70 (2000)  
Target
Name:
Prostaglandin G/H synthase 1
Synonyms:
COX1 Cyclooxygenase-1 (COX-1) PTGS1 | Prostaglandin G/H synthase (cyclooxygenase)
Type:
Protein
Mol. Mass.:
68868.60
Organism:
Ovis aries (Sheep)
Description:
Residue:
600
  
Inhibitor
Name:
BDBM22952
Synonyms:
CHEMBL73572 methyl 2-{1-[(4-chlorophenyl)carbonyl]-5-methoxy-2-methyl-1H-indol-3-yl}acetate
Type:
Small organic molecule
Emp. Form.:
C20H18ClNO4
Mol. Mass.:
371.814
SMILES:
COC(=O)Cc1c(C)n(C(=O)c2ccc(Cl)cc2)c2ccc(OC)cc12
: