Target
Sodium-dependent serotonin transporter
Ligand
BDBM82071
Substrate
Meas. Tech.
ChEMBL_1929927 (CHEMBL4433103)
IC50
200±n/a nM
Citation
 Paudel, SAcharya, SYoon, GKim, KMCheon, SH Exploration of substituted arylpiperazine-tetrazoles as promising dual norepinephrine and dopamine reuptake inhibitors. Bioorg Med Chem 24:5546-5555 (2016)  
Target
Name:
Sodium-dependent serotonin transporter
Synonyms:
5-HT Transporter 5HTT SC6A4_HUMAN SLC6A4 Serotonin transporter (5HTT) Sodium-dependent serotonin transporter (SERT) | Solute carrier family 6 member 4
Type:
Multi-pass membrane protein
Mol. Mass.:
70322.51
Organism:
Homo sapiens (Human)
Description:
P31645
Residue:
630
  
Inhibitor
Name:
BDBM82071
Synonyms:
CAS_93413-69-5 NSC_62923 Venlafaxine hydrochloride WY-45655
Type:
Small organic molecule
Emp. Form.:
C17H27NO2
Mol. Mass.:
277.4018
SMILES:
COc1ccc(cc1)C(CN(C)C)C1(O)CCCCC1
: