Target
Sodium-dependent dopamine transporter
Ligand
BDBM50091098
Substrate
Meas. Tech.
ChEMBL_61667 (CHEMBL879871)
Ki
2038±n/a nM
Citation
 Wilson, AAGinovart, NSchmidt, MMeyer, JHThrelkeld, PGHoule, S Novel radiotracers for imaging the serotonin transporter by positron emission tomography: synthesis, radiosynthesis, and in vitro and ex vivo evaluation of (11)C-labeled 2-(phenylthio)araalkylamines. J Med Chem 43:3103-10 (2000)  
Target
Name:
Sodium-dependent dopamine transporter
Synonyms:
DA transporter DAT1 Dopamine transporter protein (DAT) SC6A3_HUMAN Sodium-dependent dopamine transporter Solute carrier family 6 member 3
Type:
Multi-pass membrane protein
Mol. Mass.:
68497.11
Organism:
Homo sapiens (Human)
Description:
Q01959
Residue:
620
  
Inhibitor
Name:
BDBM50091098
Synonyms:
2-(2-Dimethylaminomethyl-phenylsulfanyl)-5-trifluoromethyl-phenylamine | CHEMBL104673
Type:
Small organic molecule
Emp. Form.:
C16H17F3N2S
Mol. Mass.:
326.38
SMILES:
CN(C)Cc1ccccc1Sc1ccc(cc1N)C(F)(F)F
: