Target
Endothelin-1 receptor
Ligand
BDBM50091107
Substrate
Meas. Tech.
ChEMBL_65638 (CHEMBL681520)
Ki
11±n/a nM
Citation
 Murugesan, NGu, ZStein, PDSpergel, SMathur, ALeith, LLiu, ECZhang, RBird, EWaldron, TMarino, AMorrison, RAWebb, MLMoreland, SBarrish, JC Biphenylsulfonamide endothelin receptor antagonists. 2. Discovery of 4'-oxazolyl biphenylsulfonamides as a new class of potent, highly selective ET(A) antagonists. J Med Chem 43:3111-7 (2000)  
Target
Name:
Endothelin-1 receptor
Synonyms:
EDNRA ET-A ETA-R Endothelin receptor type A hET-AR
Type:
Enzyme Catalytic Domain
Mol. Mass.:
48736.88
Organism:
Homo sapiens (Human)
Description:
P25101
Residue:
427
  
Inhibitor
Name:
BDBM50091107
Synonyms:
4'-(5-Methyl-oxazol-2-yl)-biphenyl-2-sulfonic acid (3,4-dimethyl-isoxazol-5-yl)-amide | CHEMBL322674
Type:
Small organic molecule
Emp. Form.:
C21H19N3O4S
Mol. Mass.:
409.458
SMILES:
Cc1cnc(o1)-c1ccc(cc1)-c1ccccc1S(=O)(=O)Nc1onc(C)c1C
: