Target
Transporter
Ligand
BDBM50091436
Substrate
Meas. Tech.
ChEBML_143114
Ki
963.0±n/a nM
Citation
 Tamagnan, GBaldwin, RMKula, NSBaldessarini, RJInnis, RB Synthesis and monoamine transporter affinity of 2beta-carbomethoxy-3beta-(2''-, 3''- or 4''-substituted) biphenyltropanes. Bioorg Med Chem Lett 10:1783-5 (2000)  
Target
Name:
Transporter
Synonyms:
Monoamine transporters; Norepininephrine & dopamine | Norepinephrine Monoamine transporters
Type:
PROTEIN
Mol. Mass.:
66787.87
Organism:
Rattus norvegicus
Description:
ChEMBL_1463061
Residue:
597
  
Inhibitor
Name:
BDBM50091436
Synonyms:
8-Methyl-3-(3'-nitro-biphenyl-4-yl)-8-aza-bicyclo[3.2.1]octane-2-carboxylic acid methyl ester | CHEMBL301174
Type:
Small organic molecule
Emp. Form.:
C22H24N2O4
Mol. Mass.:
380.437
SMILES:
COC(=O)C1C2CCC(CC1c1ccc(cc1)-c1cccc(c1)[N+]([O-])=O)N2C
: