Target
Atrial natriuretic peptide receptor 3
Ligand
BDBM50091748
Substrate
Meas. Tech.
ChEBML_34991
Ki
680±n/a nM
Citation
 Veale, CAAlford, VCAharony, DBanville, DLBialecki, RABrown, FJDamewood, JRDantzman, CLEdwards, PDJacobs, RTMauger, RCMurphy, MMPalmer, WPine, KKRumsey, WLGarcia-Davenport, LEShaw, ASteelman, GBSurian, JMVacek, EP The discovery of non-basic atrial natriuretic peptide clearance receptor antagonists. Part 1. Bioorg Med Chem Lett 10:1949-52 (2001)  
Target
Name:
Atrial natriuretic peptide receptor 3
Synonyms:
ANP-C ANPRC Atrial natriuretic peptide C-type receptor Atrial natriuretic peptide receptor C5orf23 NPR3 | NPRC
Type:
PROTEIN
Mol. Mass.:
59805.12
Organism:
Homo sapiens (Human)
Description:
ChEMBL_34991
Residue:
541
  
Inhibitor
Name:
BDBM50091748
Synonyms:
(S)-N-[(S)-4-Guanidino-1-((S)-2-methyl-butylcarbamoyl)-butyl]-3-{(S)-2-[(S)-5-guanidino-2-(2-{4-[(naphthalene-2-carbonyl)-amino]-phenyl}-acetylamino)-pentanoylamino]-propionylamino}-succinamic acid | CHEMBL294262
Type:
Small organic molecule
Emp. Form.:
C43H60N12O8
Mol. Mass.:
873.0121
SMILES:
CC[C@H](C)CNC(=O)[C@H](CCCNC(N)=N)NC(=O)[C@H](CC(O)=O)NC(=O)[C@H](C)NC(=O)[C@H](CCCNC(N)=N)NC(=O)Cc1ccc(NC(=O)c2ccc3ccccc3c2)cc1
: