Target
Nitric oxide synthase, brain
Ligand
BDBM50091803
Substrate
Meas. Tech.
ChEBML_143353
IC50
510±n/a nM
Citation
 Hagmann, WKCaldwell, CGChen, PDurette, PLEsser, CKLanza, TJKopka, IEGuthikonda, RShah, SKMacCoss, MChabin, RMFletcher, DGrant, SKGreen, BGHumes, JLKelly, TMLuell, SMeurer, RMoore, VPacholok, SGPavia, TWilliams, HRWong, KK Substituted 2-aminopyridines as inhibitors of nitric oxide synthases. Bioorg Med Chem Lett 10:1975-8 (2001)  
Target
Name:
Nitric oxide synthase, brain
Synonyms:
Constitutive NOS NC-NOS NOS type I nNOS NOS1_HUMAN Neuronal nitric oxide synthase Nitric oxide synthase, neuronal (nNOS) bNOS | nNOS
Type:
Homodimer
Mol. Mass.:
160985.98
Organism:
Homo sapiens (Human)
Description:
P29475
Residue:
1434
  
Inhibitor
Name:
BDBM50091803
Synonyms:
4-Methyl-6-(3-methyl-butyl)-pyridin-2-ylamine | CHEMBL60372
Type:
Small organic molecule
Emp. Form.:
C11H18N2
Mol. Mass.:
178.274
SMILES:
CC(C)CCc1cc(C)cc(N)n1
: