Target
Muscarinic acetylcholine receptor M5
Ligand
BDBM50451110
Substrate
Meas. Tech.
ChEBML_139395
Ki
309±n/a nM
Citation
 Billard, WBinch, HBratzler, KChen, LYCrosby, GDuffy, RADugar, SLachowicz, JMcQuade, RPushpavanam, PRuperto, VBTaylor, LAClader, JW Diphenylsulfone muscarinic antagonists: piperidine derivatives with high M2 selectivity and improved potency. Bioorg Med Chem Lett 10:2209-12 (2001)  
Target
Name:
Muscarinic acetylcholine receptor M5
Synonyms:
ACM5_HUMAN | CHRM5
Type:
PROTEIN
Mol. Mass.:
60102.35
Organism:
Homo sapiens (Human)
Description:
ChEMBL_1517990
Residue:
532
  
Inhibitor
Name:
BDBM50451110
Synonyms:
CHEMBL2111540
Type:
Small organic molecule
Emp. Form.:
C25H31N3O2S
Mol. Mass.:
437.598
SMILES:
COc1ccc(cc1)[S@@+]([O-])c1ccc(cc1)C(C#N)N1CCN(CC1)C1CCCCC1
: