Target
Muscarinic acetylcholine receptor M1
Ligand
BDBM50451115
Substrate
Meas. Tech.
ChEBML_138418
Ki
70±n/a nM
Citation
 Billard, WBinch, HBratzler, KChen, LYCrosby, GDuffy, RADugar, SLachowicz, JMcQuade, RPushpavanam, PRuperto, VBTaylor, LAClader, JW Diphenylsulfone muscarinic antagonists: piperidine derivatives with high M2 selectivity and improved potency. Bioorg Med Chem Lett 10:2209-12 (2001)  
Target
Name:
Muscarinic acetylcholine receptor M1
Synonyms:
ACM1_HUMAN Cholinergic receptor, muscarinic 1 | Cholinergic, muscarinic M1
Type:
Protein
Mol. Mass.:
51442.54
Organism:
Homo sapiens (Human)
Description:
P11229
Residue:
460
  
Inhibitor
Name:
BDBM50451115
Synonyms:
CHEMBL2115127
Type:
Small organic molecule
Emp. Form.:
C25H31NO3S
Mol. Mass.:
425.584
SMILES:
COc1ccc(cc1)[S@+]([O-])c1ccc(cc1)C(=O)C1CCN(CC1)C1CCCCC1
: