Target
Muscarinic acetylcholine receptor M2
Ligand
BDBM50092319
Substrate
Meas. Tech.
ChEBML_139773
Ki
1±n/a nM
Citation
 Billard, WBinch, HBratzler, KChen, LYCrosby, GDuffy, RADugar, SLachowicz, JMcQuade, RPushpavanam, PRuperto, VBTaylor, LAClader, JW Diphenylsulfone muscarinic antagonists: piperidine derivatives with high M2 selectivity and improved potency. Bioorg Med Chem Lett 10:2209-12 (2001)  
Target
Name:
Muscarinic acetylcholine receptor M2
Synonyms:
ACM2_HUMAN Cholinergic, muscarinic M2 Muscarinic acetylcholine receptor M2 and M5 | RecName: Full=Muscarinic acetylcholine receptor M2
Type:
GPCR
Mol. Mass.:
51730.61
Organism:
Homo sapiens (Human)
Description:
P08172
Residue:
466
  
Inhibitor
Name:
BDBM50092319
Synonyms:
1-Cyclohexyl-4-{1-[4-(4-methoxy-benzenesulfinyl)-phenyl]-ethyl}-piperazine | CHEMBL307810
Type:
Small organic molecule
Emp. Form.:
C25H34N2O2S
Mol. Mass.:
426.615
SMILES:
COc1ccc(cc1)S(=O)c1ccc(cc1)C(C)N1CCN(CC1)C1CCCCC1
: