Target
Gastrin/cholecystokinin type B receptor
Ligand
BDBM50092391
Substrate
Meas. Tech.
ChEMBL_48099 (CHEMBL663086)
Ki
22800±n/a nM
Citation
 Bellier, BMillion, MEDaNascimento, SMeudal, HKellou, SMaigret, BGarbay, C Replacement of glycine with dicarbonyl and related moieties in analogues of the C-terminal pentapeptide of cholecystokinin: CCK(2) agonists displaying a novel binding mode. J Med Chem 43:3614-23 (2000)  
Target
Name:
Gastrin/cholecystokinin type B receptor
Synonyms:
CCK-2 receptor CCK-BR CCKRB Cholecystokinin receptor GASR_HUMAN | Gastrin/cholecystokinin type B receptor
Type:
G Protein-Coupled Receptor (GPCR)
Mol. Mass.:
48445.79
Organism:
Homo sapiens (Human)
Description:
Stable expression of human CCK-2 receptors in HEK 293 cells.
Residue:
447
  
Inhibitor
Name:
BDBM50092391
Synonyms:
3-(2-{[2-(2-Carbamoyl-acetylamino)-3-(1H-indol-3-yl)-propionyl]-methyl-amino}-hexanoylamino)-N-(1-carbamoyl-2-phenyl-ethyl)-succinamic acid | CHEMBL331394
Type:
Small organic molecule
Emp. Form.:
C34H43N7O8
Mol. Mass.:
677.7473
SMILES:
CCCC[C@H](N(C)C(=O)[C@H](Cc1c[nH]c2ccccc12)NC(=O)CC(N)=O)C(=O)N[C@@H](CC(O)=O)C(=O)N[C@@H](Cc1ccccc1)C(N)=O
: