Target
Gastrin/cholecystokinin type B receptor
Ligand
BDBM50092411
Substrate
Meas. Tech.
ChEMBL_48099 (CHEMBL663086)
Ki
4.07±n/a nM
Citation
 Bellier, BMillion, MEDaNascimento, SMeudal, HKellou, SMaigret, BGarbay, C Replacement of glycine with dicarbonyl and related moieties in analogues of the C-terminal pentapeptide of cholecystokinin: CCK(2) agonists displaying a novel binding mode. J Med Chem 43:3614-23 (2000)  
Target
Name:
Gastrin/cholecystokinin type B receptor
Synonyms:
CCK-2 receptor CCK-BR CCKRB Cholecystokinin receptor GASR_HUMAN | Gastrin/cholecystokinin type B receptor
Type:
G Protein-Coupled Receptor (GPCR)
Mol. Mass.:
48445.79
Organism:
Homo sapiens (Human)
Description:
Stable expression of human CCK-2 receptors in HEK 293 cells.
Residue:
447
  
Inhibitor
Name:
BDBM50092411
Synonyms:
2-tert-Butoxycarbonylamino-N-[1-({1-[1-(1-carbamoyl-2-phenyl-ethylcarbamoyl)-2-carboxy-ethylcarbamoyl]-pentyl}-methyl-carbamoyl)-2-(1H-indol-3-yl)-ethyl]-succinamic acid | CHEMBL333516
Type:
Small organic molecule
Emp. Form.:
C40H53N7O11
Mol. Mass.:
807.8891
SMILES:
CCCC[C@H](N(C)C(=O)[C@H](Cc1c[nH]c2ccccc12)NC(=O)C[C@@H](NC(=O)OC(C)(C)C)C(O)=O)C(=O)N[C@@H](CC(O)=O)C(=O)N[C@@H](Cc1ccccc1)C(N)=O
: