Target
Kappa-type opioid receptor
Ligand
BDBM50092519
Substrate
Meas. Tech.
ChEMBL_145389 (CHEMBL750079)
Ki
190±n/a nM
Citation
 Siener, TCambareri, AKuhl, UEnglberger, WHaurand, MKögel, BHolzgrabe, U Synthesis and opioid receptor affinity of a series of 2, 4-diaryl-substituted 3,7-diazabicylononanones. J Med Chem 43:3746-51 (2000)  
Target
Name:
Kappa-type opioid receptor
Synonyms:
K-OR-1 Kappa-opioid receptor (KOR) Kappa-type opioid receptor (KOR) OPIATE Kappa OPRK1 kappa opioid receptor (KOR)
Type:
G Protein-Coupled Receptor (GPCR)
Mol. Mass.:
42648.76
Organism:
Homo sapiens (Human)
Description:
P41145
Residue:
380
  
Inhibitor
Name:
BDBM50092519
Synonyms:
3-{[(Methoxycarbonyl-quinolin-2-yl-methyl)-methyl-amino]-quinolin-2-yl-methyl}-1-methyl-4-oxo-piperidine-3-carboxylic acid methyl ester | CHEMBL369719
Type:
Small organic molecule
Emp. Form.:
C31H30N4O5
Mol. Mass.:
538.5937
SMILES:
COC(=O)C12CN(C)CC(C(N(C)C1c1ccc3ccccc3n1)c1ccc3ccccc3n1)(C(=O)OC)C2=O
: