Target
Kappa-type opioid receptor
Ligand
BDBM50092521
Substrate
Meas. Tech.
ChEMBL_145389 (CHEMBL750079)
Ki
26±n/a nM
Citation
 Siener, TCambareri, AKuhl, UEnglberger, WHaurand, MKögel, BHolzgrabe, U Synthesis and opioid receptor affinity of a series of 2, 4-diaryl-substituted 3,7-diazabicylononanones. J Med Chem 43:3746-51 (2000)  
Target
Name:
Kappa-type opioid receptor
Synonyms:
K-OR-1 Kappa-opioid receptor (KOR) Kappa-type opioid receptor (KOR) OPIATE Kappa OPRK1 kappa opioid receptor (KOR)
Type:
G Protein-Coupled Receptor (GPCR)
Mol. Mass.:
42648.76
Organism:
Homo sapiens (Human)
Description:
P41145
Residue:
380
  
Inhibitor
Name:
BDBM50092521
Synonyms:
3-((3-Fluoro-phenyl)-{[(3-fluoro-phenyl)-methoxycarbonyl-methyl]-methyl-amino}-methyl)-1-methyl-4-oxo-piperidine-3-carboxylic acid methyl ester CHEMBL447234
Type:
Small organic molecule
Emp. Form.:
C25H26F2N2O5
Mol. Mass.:
472.4811
SMILES:
COC(=O)C12CN(C)CC(C(N(C)C1c1cccc(F)c1)c1cccc(F)c1)(C(=O)OC)C2=O
: