Target
Lactoylglutathione lyase
Ligand
BDBM50092824
Substrate
Meas. Tech.
ChEMBL_71286 (CHEMBL684427)
Ki
3600±n/a nM
Citation
 Kalsi, AKavarana, MJLu, TWhalen, DLHamilton, DSCreighton, DJ Role of hydrophobic interactions in binding S-(N-aryl/alkyl-N-hydroxycarbamoyl)glutathiones to the active site of the antitumor target enzyme glyoxalase I. J Med Chem 43:3981-6 (2000)  
Target
Name:
Lactoylglutathione lyase
Synonyms:
Aldoketomutase Glx I Glyoxalase I LGUL_HUMAN S-D-lactoylglutathione methylglyoxal lyase
Type:
Enzyme
Mol. Mass.:
20772.95
Organism:
Homo sapiens (Human)
Description:
Q04760
Residue:
184
  
Inhibitor
Name:
BDBM50092824
Synonyms:
CHEMBL131578 | S-(N-4chlorophenyl-N-hydroxycarbamoyl)glutathione
Type:
Small organic molecule
Emp. Form.:
C17H21ClN4O8S
Mol. Mass.:
476.889
SMILES:
N[C@@H](CCC(=O)N[C@@H](CSC(=O)N(O)c1ccc(Cl)cc1)C(=O)NCC(O)=O)C(O)=O
: