Target
Transcription factor Jun
Ligand
BDBM50092880
Substrate
Meas. Tech.
ChEMBL_28876 (CHEMBL645946)
IC50
600±n/a nM
Citation
 Palanki, MSErdman, PEGayo-Fung, LMShevlin, GISullivan, RWGoldman, MERansone, LJBennett, BLManning, AMSuto, MJ Inhibitors of NF-kappaB and AP-1 gene expression: SAR studies on the pyrimidine portion of 2-chloro-4-trifluoromethylpyrimidine-5-[N-(3', 5'-bis(trifluoromethyl)phenyl)carboxamide]. J Med Chem 43:3995-4004 (2000)  
Target
Name:
Transcription factor Jun
Synonyms:
AP1 JUN Proto-oncogene c-JUN Transcription factor AP1 p39
Type:
Mol. Mass.:
35683.24
Organism:
Homo sapiens (Human)
Description:
P05412
Residue:
331
  
Inhibitor
Name:
BDBM50092880
Synonyms:
2-Chloro-4-pentafluoroethyl-pyrimidine-5-carboxylic acid (3,5-bis-trifluoromethyl-phenyl)-amide | CHEMBL421280
Type:
Small organic molecule
Emp. Form.:
C15H5ClF11N3O
Mol. Mass.:
487.655
SMILES:
FC(F)(F)c1cc(NC(=O)c2cnc(Cl)nc2C(F)(F)C(F)(F)F)cc(c1)C(F)(F)F
: