Target
Muscarinic acetylcholine receptor M3
Ligand
BDBM50092957
Substrate
Meas. Tech.
ChEBML_138706
Ki
3.4±n/a nM
Citation
 Wang, YChackalamannil, SHu, ZClader, JWGreenlee, WBillard, WBinch, HCrosby, GRuperto, VDuffy, RAMcQuade, RLachowicz, JE Design and synthesis of piperidinyl piperidine analogues as potent and selective M2 muscarinic receptor antagonists. Bioorg Med Chem Lett 10:2247-50 (2001)  
Target
Name:
Muscarinic acetylcholine receptor M3
Synonyms:
ACM3_HUMAN Cholinergic, muscarinic M3 Muscarinic receptor M3 | RecName: Full=Muscarinic acetylcholine receptor M3
Type:
Enzyme
Mol. Mass.:
66151.03
Organism:
Homo sapiens (Human)
Description:
P20309
Residue:
590
  
Inhibitor
Name:
BDBM50092957
Synonyms:
4-(1-(4-(4-methoxyphenylsulfonyl)phenyl)vinyl)-1-(piperidin-4-yl)piperidine CHEMBL420008
Type:
Small organic molecule
Emp. Form.:
C25H32N2O3S
Mol. Mass.:
440.598
SMILES:
COc1ccc(cc1)S(=O)(=O)c1ccc(cc1)C(=C)C1CCN(CC1)C1CCNCC1
: