Target
Aldehyde dehydrogenase, mitochondrial
Ligand
BDBM50093531
Substrate
Meas. Tech.
ChEMBL_28556 (CHEMBL641008)
IC50
9.0±n/a nM
Citation
 Rooke, NLi, DJLi, JKeung, WM The mitochondrial monoamine oxidase-aldehyde dehydrogenase pathway: a potential site of action of daidzin. J Med Chem 43:4169-79 (2000)  
Target
Name:
Aldehyde dehydrogenase, mitochondrial
Synonyms:
ALDH class 2 ALDH2 ALDHI Aldehyde dehydrogenase (ALDH2)
Type:
Enzyme
Mol. Mass.:
56382.67
Organism:
Homo sapiens (Human)
Description:
P05091
Residue:
517
  
Inhibitor
Name:
BDBM50093531
Synonyms:
6-[3-(4-Hydroxy-phenyl)-4-oxo-4H-chromen-7-yloxy]-hexanoic acid | CHEMBL113640
Type:
Small organic molecule
Emp. Form.:
C21H20O6
Mol. Mass.:
368.3799
SMILES:
OC(=O)CCCCCOc1ccc2c(c1)occ(-c1ccc(O)cc1)c2=O
: