Target
Neuropeptide Y receptor type 5
Ligand
BDBM50093669
Substrate
Meas. Tech.
ChEMBL_143676 (CHEMBL857689)
IC50
7500±n/a nM
Citation
 Norman, MHChen, NChen, ZFotsch, CHale, CHan, NHurt, RJenkins, TKincaid, JLiu, LLu, YMoreno, OSantora, VJSonnenberg, JDKarbon, W Structure-activity relationships of a series of pyrrolo[3,2-d]pyrimidine derivatives and related compounds as neuropeptide Y5 receptor antagonists. J Med Chem 43:4288-312 (2000)  
Target
Name:
Neuropeptide Y receptor type 5
Synonyms:
NPY-Y5 NPY5-R NPY5R_HUMAN NPYY5 Neuropeptide Y receptor type 5 ( NPY Y5) | Y5 receptor
Type:
Enzyme
Mol. Mass.:
50746.64
Organism:
Homo sapiens (Human)
Description:
Q15761
Residue:
445
  
Inhibitor
Name:
BDBM50093669
Synonyms:
4-(4-Methanesulfonyl-piperazin-1-yl)-2-methyl-6-phenyl-5H-pyrrolo[3,2-d]pyrimidine | CHEMBL139270
Type:
Small organic molecule
Emp. Form.:
C18H21N5O2S
Mol. Mass.:
371.457
SMILES:
Cc1nc(N2CCN(CC2)S(C)(=O)=O)c2[nH]c(cc2n1)-c1ccccc1
: