Target
Neuropeptide Y receptor type 5
Ligand
BDBM50093676
Substrate
Meas. Tech.
ChEMBL_143676 (CHEMBL857689)
IC50
2300±n/a nM
Citation
 Norman, MHChen, NChen, ZFotsch, CHale, CHan, NHurt, RJenkins, TKincaid, JLiu, LLu, YMoreno, OSantora, VJSonnenberg, JDKarbon, W Structure-activity relationships of a series of pyrrolo[3,2-d]pyrimidine derivatives and related compounds as neuropeptide Y5 receptor antagonists. J Med Chem 43:4288-312 (2000)  
Target
Name:
Neuropeptide Y receptor type 5
Synonyms:
NPY-Y5 NPY5-R NPY5R_HUMAN NPYY5 Neuropeptide Y receptor type 5 ( NPY Y5) | Y5 receptor
Type:
Enzyme
Mol. Mass.:
50746.64
Organism:
Homo sapiens (Human)
Description:
Q15761
Residue:
445
  
Inhibitor
Name:
BDBM50093676
Synonyms:
6-Phenyl-4-piperidin-1-yl-5H-pyrrolo[3,2-d]pyrimidine | CHEMBL138383
Type:
Small organic molecule
Emp. Form.:
C17H18N4
Mol. Mass.:
278.3516
SMILES:
C1CCN(CC1)c1ncnc2cc([nH]c12)-c1ccccc1
: