Target
Neuropeptide Y receptor type 5
Ligand
BDBM50093686
Substrate
Meas. Tech.
ChEMBL_143676 (CHEMBL857689)
IC50
380±n/a nM
Citation
 Norman, MHChen, NChen, ZFotsch, CHale, CHan, NHurt, RJenkins, TKincaid, JLiu, LLu, YMoreno, OSantora, VJSonnenberg, JDKarbon, W Structure-activity relationships of a series of pyrrolo[3,2-d]pyrimidine derivatives and related compounds as neuropeptide Y5 receptor antagonists. J Med Chem 43:4288-312 (2000)  
Target
Name:
Neuropeptide Y receptor type 5
Synonyms:
NPY-Y5 NPY5-R NPY5R_HUMAN NPYY5 Neuropeptide Y receptor type 5 ( NPY Y5) | Y5 receptor
Type:
Enzyme
Mol. Mass.:
50746.64
Organism:
Homo sapiens (Human)
Description:
Q15761
Residue:
445
  
Inhibitor
Name:
BDBM50093686
Synonyms:
6-(2,6-Difluoro-phenyl)-2-methyl-4-piperidin-1-yl-5H-pyrrolo[3,2-d]pyrimidine | CHEMBL137350
Type:
Small organic molecule
Emp. Form.:
C18H18F2N4
Mol. Mass.:
328.3591
SMILES:
Cc1nc(N2CCCCC2)c2[nH]c(cc2n1)-c1c(F)cccc1F
: