Target
Muscarinic acetylcholine receptor M2
Ligand
BDBM50093896
Substrate
Meas. Tech.
ChEBML_139909
EC50
3±n/a nM
Citation
 Zlotos, DPBuller, STränkle, CMohr, K Bisquaternary caracurine V derivatives as allosteric modulators of ligand binding to M2 acetylcholine receptors. Bioorg Med Chem Lett 10:2529-32 (2001)  
Target
Name:
Muscarinic acetylcholine receptor M2
Synonyms:
ACM2_PIG Cholinergic, muscarinic LOC100715343 Muscarinic receptor 2
Type:
Enzyme Catalytic Domain
Mol. Mass.:
51688.65
Organism:
GUINEA PIG
Description:
Cholinergic, muscarinic 0 GUINEA PIG::P06199
Residue:
466
  
Inhibitor
Name:
BDBM50093896
Synonyms:
CHEMBL311649 | Caracurine V derivative
Type:
Small organic molecule
Emp. Form.:
C44H50N4O2
Mol. Mass.:
666.8923
SMILES:
C=CC[N+]12CCC34[C@@H]1C[C@@H]1[C@@H]5[C@@H]3N([C@@H]3OCC=C6C[N+]7(CC=C)CCC89[C@@H]7C[C@@H]6[C@@H]3[C@@H]8N([C@@H]5OCC=C1C2)c1ccccc91)c1ccccc41
: