Target
Cytochrome P450 2D6
Ligand
BDBM50538669
Substrate
Meas. Tech.
ChEMBL_1973672 (CHEMBL4606490)
EC50
50000±n/a nM
Citation
 Janetka, JWHopper, ATYang, ZBarks, JDhason, MSWang, QSibley, LD Optimizing Pyrazolopyrimidine Inhibitors of Calcium Dependent Protein Kinase 1 for Treatment of Acute and Chronic Toxoplasmosis. J Med Chem 63:6144-6163 (2020)  
Target
Name:
Cytochrome P450 2D6
Synonyms:
CP2D6_HUMAN CYP2DL1 Cytochrome P450 2D6 (CYP2D6) P450-DB1
Type:
Protein
Mol. Mass.:
55774.82
Organism:
Homo sapiens (Human)
Description:
P10635
Residue:
497
  
Inhibitor
Name:
BDBM50538669
Synonyms:
CHEMBL4646408
Type:
Small organic molecule
Emp. Form.:
C17H17F3N6O2
Mol. Mass.:
394.3511
SMILES:
Nc1ncnc2n(nc(Oc3cc(ccn3)C(F)(F)F)c12)[C@@H]1CCCC[C@H]1O
: