Target
Adenosine receptor A2a
Ligand
BDBM50082423
Substrate
Meas. Tech.
ChEMBL_31812 (CHEMBL642233)
Ki
0.16±n/a nM
Citation
 Baraldi, PGCacciari, BRomagnoli, RSpalluto, GMoro, SKlotz, KNLeung, EVarani, KGessi, SMerighi, SBorea, PA Pyrazolo[4,3-e]1,2,4-triazolo[1,5-c]pyrimidine derivatives as highly potent and selective human A(3) adenosine receptor antagonists: influence of the chain at the N(8) pyrazole nitrogen. J Med Chem 43:4768-80 (2000)  
Target
Name:
Adenosine receptor A2a
Synonyms:
A2A adenosine receptor (hA2A) ADENOSINE A2 ADORA2 Adenosine A2A receptor (A2AAR)
Type:
G Protein-Coupled Receptor (GPCR)
Mol. Mass.:
44716.46
Organism:
Homo sapiens (Human)
Description:
P29274
Residue:
412
  
Inhibitor
Name:
BDBM50082423
Synonyms:
2-(furan-2-yl)-8-(3-phenylpropyl)-8H-pyrazolo[4,3-e][1,2,4]triazolo[1,5-c]pyrimidin-5-amine 2-Furan-2-yl-8-phenethyl-8H-pyrazolo[4,3-e][1,2,4]triazolo[1,5-c]pyrimidin-5-ylamine | CHEMBL423542
Type:
Small organic molecule
Emp. Form.:
C19H17N7O
Mol. Mass.:
359.3846
SMILES:
Nc1nc2nn(CCCc3ccccc3)cc2c2nc(nn12)-c1ccco1
: