Target
Adenosine receptor A1
Ligand
BDBM50082417
Substrate
Meas. Tech.
ChEMBL_28056 (CHEMBL643049)
Ki
5±n/a nM
Citation
 Baraldi, PGCacciari, BRomagnoli, RSpalluto, GMoro, SKlotz, KNLeung, EVarani, KGessi, SMerighi, SBorea, PA Pyrazolo[4,3-e]1,2,4-triazolo[1,5-c]pyrimidine derivatives as highly potent and selective human A(3) adenosine receptor antagonists: influence of the chain at the N(8) pyrazole nitrogen. J Med Chem 43:4768-80 (2000)  
Target
Name:
Adenosine receptor A1
Synonyms:
A1 adenosine receptor (hA1) AA1R_HUMAN ADORA1 Adenosine A1-receptor Adenosine receptor A1 (hA1) | Adenosine transporter (AdT)
Type:
G Protein-Coupled Receptor (GPCR)
Mol. Mass.:
36520.92
Organism:
Homo sapiens (Human)
Description:
P30542
Residue:
326
  
Inhibitor
Name:
BDBM50082417
Synonyms:
8-Ethyl-2-furan-2-yl-8H-pyrazolo[4,3-e][1,2,4]triazolo[1,5-c]pyrimidin-5-ylamine 8-ethyl-2-(furan-2-yl)-8H-pyrazolo[4,3-e][1,2,4]triazolo[1,5-c]pyrimidin-5-amine | CHEMBL137879
Type:
Small organic molecule
Emp. Form.:
C12H11N7O
Mol. Mass.:
269.262
SMILES:
CCn1cc2c(n1)nc(N)n1nc(nc21)-c1ccco1
: