Target
Adenosine receptor A3
Ligand
BDBM50094694
Substrate
Meas. Tech.
ChEMBL_31541 (CHEMBL644492)
IC50
2±n/a nM
Citation
 Baraldi, PGCacciari, BRomagnoli, RSpalluto, GMoro, SKlotz, KNLeung, EVarani, KGessi, SMerighi, SBorea, PA Pyrazolo[4,3-e]1,2,4-triazolo[1,5-c]pyrimidine derivatives as highly potent and selective human A(3) adenosine receptor antagonists: influence of the chain at the N(8) pyrazole nitrogen. J Med Chem 43:4768-80 (2000)  
Target
Name:
Adenosine receptor A3
Synonyms:
A3 adenosine receptor (hA3) ADORA3 | Adenosine A3 receptor (A3AR)
Type:
G Protein-Coupled Receptor (GPCR)
Mol. Mass.:
36197.32
Organism:
Homo sapiens (Human)
Description:
P0DMS8
Residue:
318
  
Inhibitor
Name:
BDBM50094694
Synonyms:
1-(9-Chloro-2-furan-2-yl-[1,2,4]triazolo[1,5-c]quinazolin-5-yl)-3-(4-methoxy-phenyl)-urea | CHEMBL144979
Type:
Small organic molecule
Emp. Form.:
C21H15ClN6O3
Mol. Mass.:
434.835
SMILES:
COc1ccc(NC(=O)Nc2nc3ccc(Cl)cc3c3nc(nn23)-c2ccco2)cc1
: