Target
Adenosine receptor A2a
Ligand
BDBM50082416
Substrate
Meas. Tech.
ChEMBL_31819 (CHEMBL642240)
Ki
2.51±n/a nM
Citation
 Baraldi, PGCacciari, BRomagnoli, RSpalluto, GMoro, SKlotz, KNLeung, EVarani, KGessi, SMerighi, SBorea, PA Pyrazolo[4,3-e]1,2,4-triazolo[1,5-c]pyrimidine derivatives as highly potent and selective human A(3) adenosine receptor antagonists: influence of the chain at the N(8) pyrazole nitrogen. J Med Chem 43:4768-80 (2000)  
Target
Name:
Adenosine receptor A2a
Synonyms:
A2A adenosine receptor (hA2A) ADENOSINE A2 ADORA2 Adenosine A2A receptor (A2AAR)
Type:
G Protein-Coupled Receptor (GPCR)
Mol. Mass.:
44716.46
Organism:
Homo sapiens (Human)
Description:
P29274
Residue:
412
  
Inhibitor
Name:
BDBM50082416
Synonyms:
2-(furan-2-yl)-8-propyl-8H-pyrazolo[4,3-e][1,2,4]triazolo[1,5-c]pyrimidin-5-amine CHEMBL344706
Type:
Small organic molecule
Emp. Form.:
C13H13N7O
Mol. Mass.:
283.2886
SMILES:
CCCn1cc2c(n1)nc(N)n1nc(nc21)-c1ccco1
: