Target
Adenosine receptor A2a
Ligand
BDBM50094694
Substrate
Meas. Tech.
ChEMBL_31963 (CHEMBL640516)
Ki
9.4±n/a nM
Citation
 Baraldi, PGCacciari, BRomagnoli, RSpalluto, GMoro, SKlotz, KNLeung, EVarani, KGessi, SMerighi, SBorea, PA Pyrazolo[4,3-e]1,2,4-triazolo[1,5-c]pyrimidine derivatives as highly potent and selective human A(3) adenosine receptor antagonists: influence of the chain at the N(8) pyrazole nitrogen. J Med Chem 43:4768-80 (2000)  
Target
Name:
Adenosine receptor A2a
Synonyms:
A2A adenosine receptor (hA2A) ADENOSINE A2 ADORA2 Adenosine A2A receptor (A2AAR)
Type:
G Protein-Coupled Receptor (GPCR)
Mol. Mass.:
44716.46
Organism:
Homo sapiens (Human)
Description:
P29274
Residue:
412
  
Inhibitor
Name:
BDBM50094694
Synonyms:
1-(9-Chloro-2-furan-2-yl-[1,2,4]triazolo[1,5-c]quinazolin-5-yl)-3-(4-methoxy-phenyl)-urea | CHEMBL144979
Type:
Small organic molecule
Emp. Form.:
C21H15ClN6O3
Mol. Mass.:
434.835
SMILES:
COc1ccc(NC(=O)Nc2nc3ccc(Cl)cc3c3nc(nn23)-c2ccco2)cc1
: