Target
Metabotropic glutamate receptor 3
Ligand
BDBM50094843
Substrate
Meas. Tech.
ChEMBL_106387 (CHEMBL717242)
EC50
2.07±n/a nM
Citation
 Nakazato, AKumagai, TSakagami, KYoshikawa, RSuzuki, YChaki, SIto, HTaguchi, TNakanishi, SOkuyama, S Synthesis, SARs, and pharmacological characterization of 2-amino-3 or 6-fluorobicyclo[3.1.0]hexane-2,6-dicarboxylic acid derivatives as potent, selective, and orally active group II metabotropic glutamate receptor agonists. J Med Chem 43:4893-909 (2000)  
Target
Name:
Metabotropic glutamate receptor 3
Synonyms:
GRM3_RAT Grm3 glutamate receptor, metabotropic 3 precursor
Type:
Protein
Mol. Mass.:
98971.84
Organism:
Rattus norvegicus (Rat)
Description:
P31422
Residue:
879
  
Inhibitor
Name:
BDBM50094843
Synonyms:
(+)-2-Amino-6-fluoro-4-oxo-bicyclo[3.1.0]hexane-2,6-dicarboxylic acid (-)-2-Amino-6-fluoro-4-oxo-bicyclo[3.1.0]hexane-2,6-dicarboxylic acid CHEMBL121053
Type:
Small organic molecule
Emp. Form.:
C8H8FNO5
Mol. Mass.:
217.1512
SMILES:
N[C@]1(CC(=O)[C@@H]2[C@H]1[C@@]2(F)C(O)=O)C(O)=O
: