Target
Papain
Ligand
BDBM50094931
Substrate
Meas. Tech.
ChEBML_152642
IC50
11±n/a nM
Citation
 Schirmeister, T (S)-Thiirancarboxylic acid as a reactive building block for a new class of cysteine protease inhibitors. Bioorg Med Chem Lett 10:2647-51 (2000)  
Target
Name:
Papain
Synonyms:
Allergen=Car p 1 PPI | Papaya proteinase I
Type:
Enzyme
Mol. Mass.:
38923.01
Organism:
Carica papaya
Description:
Papain was purchased from Sigma, Germany.
Residue:
345
  
Inhibitor
Name:
BDBM50094931
Synonyms:
CHEMBL430641 | Oxirane-2,3-dicarboxylic acid monoethyl ester
Type:
Small organic molecule
Emp. Form.:
C6H8O5
Mol. Mass.:
160.1247
SMILES:
CCOC(=O)C1OC1C(O)=O
: