Target
D(2) dopamine receptor
Ligand
BDBM50095028
Substrate
Meas. Tech.
ChEBML_60047
Ki
900±n/a nM
Citation
 Smith, ALStevenson, GILewis, SPatel, SCastro, JL Solid-phase synthesis of 2,3-disubstituted indoles: discovery of a novel, high-affinity, selective h5-HT2A antagonist. Bioorg Med Chem Lett 10:2693-6 (2000)  
Target
Name:
D(2) dopamine receptor
Synonyms:
D(2) dopamine receptor DOPAMINE D2 Long DRD2 Dopamine D2 receptor Dopamine D2 receptor (D2R) Dopamine2-like | d2
Type:
Cell-surface receptors
Mol. Mass.:
50647.10
Organism:
Homo sapiens (Human)
Description:
P14416
Residue:
443
  
Inhibitor
Name:
BDBM50095028
Synonyms:
2-Phenyl-3-(2-piperidin-1-yl-ethyl)-1H-indole | CHEMBL91205
Type:
Small organic molecule
Emp. Form.:
C21H24N2
Mol. Mass.:
304.4287
SMILES:
C(Cc1c([nH]c2ccccc12)-c1ccccc1)N1CCCCC1
: