Target
D(2) dopamine receptor
Ligand
BDBM50095031
Substrate
Meas. Tech.
ChEBML_60046
Ki
>1000±n/a nM
Citation
 Stevenson, GISmith, ALLewis, SMichie, SGNeduvelil, JGPatel, SMarwood, RPatel, SCastro, JL 2-Aryl tryptamines: selective high-affinity antagonists for the h5-HT2A receptor. Bioorg Med Chem Lett 10:2697-9 (2000)  
Target
Name:
D(2) dopamine receptor
Synonyms:
D(2) dopamine receptor DOPAMINE D2 Long DRD2 Dopamine D2 receptor Dopamine D2 receptor (D2R) Dopamine2-like | d2
Type:
Cell-surface receptors
Mol. Mass.:
50647.10
Organism:
Homo sapiens (Human)
Description:
P14416
Residue:
443
  
Inhibitor
Name:
BDBM50095031
Synonyms:
2-Phenyl-3-(2-pyrrolidin-1-yl-ethyl)-1H-indole | CHEMBL90347
Type:
Small organic molecule
Emp. Form.:
C20H22N2
Mol. Mass.:
290.4021
SMILES:
C(Cc1c([nH]c2ccccc12)-c1ccccc1)N1CCCC1
: