Target
5-hydroxytryptamine receptor 2A
Ligand
BDBM50095036
Substrate
Meas. Tech.
ChEBML_2275
Ki
0.190000±n/a nM
Citation
 Stevenson, GISmith, ALLewis, SMichie, SGNeduvelil, JGPatel, SMarwood, RPatel, SCastro, JL 2-Aryl tryptamines: selective high-affinity antagonists for the h5-HT2A receptor. Bioorg Med Chem Lett 10:2697-9 (2000)  
Target
Name:
5-hydroxytryptamine receptor 2A
Synonyms:
5-HT-2 5-HT2A 5-hydroxytryptamine receptor 2A (5HT-2A) 5HT2A_HUMAN HTR2A | Serotonin receptor 2A
Type:
undefined
Mol. Mass.:
52607.65
Organism:
Homo sapiens (Human)
Description:
P28223
Residue:
471
  
Inhibitor
Name:
BDBM50095036
Synonyms:
CHEMBL330303 | {2-[2-(3,5-Bis-trifluoromethyl-phenyl)-1H-indol-3-yl]-ethyl}-ethyl-methyl-amine
Type:
Small organic molecule
Emp. Form.:
C21H20F6N2
Mol. Mass.:
414.3873
SMILES:
CCN(C)CCc1c([nH]c2ccccc12)-c1cc(cc(c1)C(F)(F)F)C(F)(F)F
: