Target
D(2) dopamine receptor
Ligand
BDBM50095038
Substrate
Meas. Tech.
ChEBML_60046
Ki
39±n/a nM
Citation
 Stevenson, GISmith, ALLewis, SMichie, SGNeduvelil, JGPatel, SMarwood, RPatel, SCastro, JL 2-Aryl tryptamines: selective high-affinity antagonists for the h5-HT2A receptor. Bioorg Med Chem Lett 10:2697-9 (2000)  
Target
Name:
D(2) dopamine receptor
Synonyms:
D(2) dopamine receptor DOPAMINE D2 Long DRD2 Dopamine D2 receptor Dopamine D2 receptor (D2R) Dopamine2-like | d2
Type:
Cell-surface receptors
Mol. Mass.:
50647.10
Organism:
Homo sapiens (Human)
Description:
P14416
Residue:
443
  
Inhibitor
Name:
BDBM50095038
Synonyms:
CHEMBL90837 | Ethyl-methyl-{2-[2-(3-nitro-phenyl)-1H-indol-3-yl]-ethyl}-amine
Type:
Small organic molecule
Emp. Form.:
C19H21N3O2
Mol. Mass.:
323.3889
SMILES:
CCN(C)CCc1c([nH]c2ccccc12)-c1cccc(c1)[N+]([O-])=O
: