Target
5-hydroxytryptamine receptor 2C
Ligand
BDBM50095047
Substrate
Meas. Tech.
ChEBML_2953
Ki
230±n/a nM
Citation
 Stevenson, GISmith, ALLewis, SMichie, SGNeduvelil, JGPatel, SMarwood, RPatel, SCastro, JL 2-Aryl tryptamines: selective high-affinity antagonists for the h5-HT2A receptor. Bioorg Med Chem Lett 10:2697-9 (2000)  
Target
Name:
5-hydroxytryptamine receptor 2C
Synonyms:
5-HT-2C 5-HT2C-INI 5-HTR2C 5-hydroxytryptamine receptor 2C (5-HT-2C) 5HT-1C HTR1C Serotonin (5-HT3) receptor Serotonin Receptor 2C
Type:
G Protein-Coupled Receptor (GPCR)
Mol. Mass.:
51836.79
Organism:
Homo sapiens (Human)
Description:
P28335
Residue:
458
  
Inhibitor
Name:
BDBM50095047
Synonyms:
3-[2-((S)-2-Methyl-piperidin-1-yl)-ethyl]-2-phenyl-1H-indole | CHEMBL90739
Type:
Small organic molecule
Emp. Form.:
C22H26N2
Mol. Mass.:
318.4552
SMILES:
C[C@H]1CCCCN1CCc1c([nH]c2ccccc12)-c1ccccc1
: