Target
Alpha-1A adrenergic receptor
Ligand
BDBM50451156
Substrate
Meas. Tech.
ChEBML_33745
Ki
13±n/a nM
Citation
 Lagu, BWetzel, JMForray, CPatane, MABock, MG Determination of the relative and absolute stereochemistry of a potent and alpha1A-selective adrenoceptor antagonist. Bioorg Med Chem Lett 10:2705-7 (2000)  
Target
Name:
Alpha-1A adrenergic receptor
Synonyms:
ADA1A_HUMAN ADRA1C Alpha 1A-adrenoceptor Alpha adrenergic receptor 1a Alpha-adrenergic receptor 1c adrenergic Alpha1 | adrenergic Alpha1C
Type:
Cell-surface receptors
Mol. Mass.:
51511.67
Organism:
Homo sapiens (Human)
Description:
P35348
Residue:
466
  
Inhibitor
Name:
BDBM50451156
Synonyms:
CHEMBL2111563
Type:
Small organic molecule
Emp. Form.:
C25H28F3N3O3
Mol. Mass.:
475.5033
SMILES:
C[C@H]1OC(=O)N([C@@H]1c1ccc(F)c(F)c1)C(=O)NCCCN1CCC(CC1)c1ccc(F)cc1
: